Reaction Details
TargetDiacylglycerol O-acyltransferase 1
LigandBDBM50438722
Substrate/Competitorn/a
Meas. Tech.ChEMBL_976374 (CHEMBL2415510)
IC50 146±n/a nM
Citation Dow, RLAndrews, MPLi, JCMichael Gibbs, EGuzman-Perez, ALaperle, JLLi, QMather, DMunchhof, MJNiosi, MPatel, LPerreault, CTapley, SZavadoski, WJ Defining the key pharmacophore elements of PF-04620110: discovery of a potent, orally-active, neutral DGAT-1 inhibitor. Bioorg Med Chem21:5081-97 (2013) 
 
Diacylglycerol O-acyltransferase 1
Name:Diacylglycerol O-acyltransferase 1
Type:Protein
Mol. Mass.:55297.82
Organism:Homo sapiens (Human)
Description:O75907
Residue:488
BDBM50438722
NameBDBM50438722
Synonyms:CHEMBL2414685
TypeSmall organic molecule
Emp. Form.C23H28N4O4
Mol. Mass.424.4928
SMILESCC1(C)CN(c2ccc(cc2)[C@H]2CC[C@H](CC(O)=O)CC2)C(=O)c2c(N)ncnc2O1