Reaction Details
TargetDiacylglycerol O-acyltransferase 1
LigandBDBM50438723
Substrate/Competitorn/a
Meas. Tech.ChEMBL_976374 (CHEMBL2415510)
IC50 134±n/a nM
Citation Dow, RLAndrews, MPLi, JCMichael Gibbs, EGuzman-Perez, ALaperle, JLLi, QMather, DMunchhof, MJNiosi, MPatel, LPerreault, CTapley, SZavadoski, WJ Defining the key pharmacophore elements of PF-04620110: discovery of a potent, orally-active, neutral DGAT-1 inhibitor. Bioorg Med Chem21:5081-97 (2013) 
 
Diacylglycerol O-acyltransferase 1
Name:Diacylglycerol O-acyltransferase 1
Type:Protein
Mol. Mass.:55297.82
Organism:Homo sapiens (Human)
Description:O75907
Residue:488
BDBM50438723
NameBDBM50438723
Synonyms:CHEMBL2414691
TypeSmall organic molecule
Emp. Form.C17H20N4O2
Mol. Mass.312.3663
SMILESCC(C)(C)c1ccc(cc1)N1CCOc2ncnc(N)c2C1=O