Reaction Details
TargetDiacylglycerol O-acyltransferase 1
LigandBDBM50438698
Substrate/Competitorn/a
Meas. Tech.ChEMBL_976374 (CHEMBL2415510)
IC50 7.0±n/a nM
Citation Dow, RLAndrews, MPLi, JCMichael Gibbs, EGuzman-Perez, ALaperle, JLLi, QMather, DMunchhof, MJNiosi, MPatel, LPerreault, CTapley, SZavadoski, WJ Defining the key pharmacophore elements of PF-04620110: discovery of a potent, orally-active, neutral DGAT-1 inhibitor. Bioorg Med Chem21:5081-97 (2013) 
 
Diacylglycerol O-acyltransferase 1
Name:Diacylglycerol O-acyltransferase 1
Type:Protein
Mol. Mass.:55297.82
Organism:Homo sapiens (Human)
Description:O75907
Residue:488
BDBM50438698
NameBDBM50438698
Synonyms:CHEMBL2414663
TypeSmall organic molecule
Emp. Form.C21H21N7O4
Mol. Mass.435.4359
SMILESNc1ncnc2OCCN(c3ccc(cc3)C3CCN(CC3)C(=O)c3cnon3)C(=O)c12