Reaction Details
TargetCoagulation factor VII/Tissue factor
LigandBDBM50440845
Substrate/Competitorn/a
Meas. Tech.ChEMBL_984127 (CHEMBL2434648)
Ki 12±n/a nM
Citation Glunz, PWZhang, XZou, YDelucca, INirschl, AHCheng, XWeigelt, CACheney, DLWei, AAnumula, RLuettgen, JMRendina, ARHarpel, MLuo, GKnabb, RWong, PCWexler, RRPriestley, ES Nonbenzamidine acylsulfonamide tissue factor-factor VIIa inhibitors. Bioorg Med Chem Lett23:5244-8 (2013) 
 
Coagulation factor VII/Tissue factor
Name:Coagulation factor VII/Tissue factor
Type:n/a
Mol. Mass.:n/a
Description:ASSAY_ID of EBI is 69535
Components:This complex has 2 components.
Component 1
Name:Tissue factor
Synonyms:CD_antigen=CD142 Coagulation factor VII/tissue factor TF Thromboplastin | Tissue factor
Type:PROTEIN
Mol. Mass.:33067.61
Organism:Homo sapiens (Human)
Description:ChEMBL_936735
Residue:295
Component 2
Name:Coagulation factor VII
Synonyms:Eptacog alfa FA7_HUMAN Factor VIIa (fVIIa) SPCA serum prothrombin conversion accelerator
Type:Enzyme
Mol. Mass.:51599.89
Organism:Homo sapiens (Human)
Description:n/a
Residue:466
BDBM50440845
NameBDBM50440845
Synonyms:CHEMBL2431611
TypeSmall organic molecule
Emp. Form.C29H31N3O7S2
Mol. Mass.597.702
SMILESCCOc1cc(ccc1OC(C)C)C(Nc1ccc2cnccc2c1)C(=O)NS(=O)(=O)c1ccccc1S(C)(=O)=O