Reaction Details
TargetLysine-specific histone demethylase 2
LigandBDBM50441979
Substrate/Competitorn/a
Meas. Tech.ChEMBL_992590 (CHEMBL2447183)
IC50 49100±n/a nM
Citation Zheng, YCDuan, YCMa, JLXu, RMZi, XLv, WLWang, MMYe, XWZhu, SMobley, DZhu, YYWang, JWLi, JFWang, ZRZhao, WLiu, HM Triazole-dithiocarbamate based selective lysine specific demethylase 1 (LSD1) inactivators inhibit gastric cancer cell growth, invasion, and migration. J Med Chem56:8543-60 (2013) 
 
Lysine-specific histone demethylase 2
Name:Lysine-specific histone demethylase 2
Type:PROTEIN
Mol. Mass.:92112.91
Organism:Homo sapiens (Human)
Description:ChEMBL_992590
Residue:822
BDBM50441979
NameBDBM50441979
Synonyms:CHEMBL2334497
TypeSmall organic molecule
Emp. Form.C20H26FN5O2S2
Mol. Mass.451.581
SMILESCC(C)(C)OC(=O)N1CCN(CC1)C(=S)SCc1cn(Cc2ccccc2F)nn1