Reaction Details
TargetTransient receptor potential cation channel subfamily M member 8
LigandBDBM50442404
Substrate/Competitorn/a
Meas. Tech.ChEMBL_989544 (CHEMBL2444600)
IC50 17±n/a nM
Citation Chaudhari, SSKadam, ABKhairatkar-Joshi, NMukhopadhyay, IKarnik, PVRaghuram, ARao, SSVaiyapuri, TSWale, DPBhosale, VMGudi, GSSangana, RRThomas, A Synthesis and pharmacological evaluation of novel N-aryl-3,4-dihydro-1'H-spiro[chromene-2,4'-piperidine]-1'-carboxamides as TRPM8 antagonists. Bioorg Med Chem21:6542-53 (2013) 
 
Transient receptor potential cation channel subfamily M member 8
Name:Transient receptor potential cation channel subfamily M member 8
Type:Enzyme
Mol. Mass.:127693.26
Organism:Homo sapiens (Human)
Description:Q7Z2W7
Residue:1104
BDBM50442404
NameBDBM50442404
Synonyms:CHEMBL2443063
TypeSmall organic molecule
Emp. Form.C21H20BrF3N2O4
Mol. Mass.501.294
SMILESO[C@@H]1CC2(CCN(CC2)C(=O)Nc2ccc(OC(F)(F)F)cc2)Oc2c(Br)cccc12