Reaction Details
TargetTransient receptor potential cation channel subfamily M member 8
LigandBDBM50442411
Substrate/Competitorn/a
Meas. Tech.ChEMBL_989544 (CHEMBL2444600)
IC50 66±n/a nM
Citation Chaudhari, SSKadam, ABKhairatkar-Joshi, NMukhopadhyay, IKarnik, PVRaghuram, ARao, SSVaiyapuri, TSWale, DPBhosale, VMGudi, GSSangana, RRThomas, A Synthesis and pharmacological evaluation of novel N-aryl-3,4-dihydro-1'H-spiro[chromene-2,4'-piperidine]-1'-carboxamides as TRPM8 antagonists. Bioorg Med Chem21:6542-53 (2013) 
 
Transient receptor potential cation channel subfamily M member 8
Name:Transient receptor potential cation channel subfamily M member 8
Type:Enzyme
Mol. Mass.:127693.26
Organism:Homo sapiens (Human)
Description:Q7Z2W7
Residue:1104
BDBM50442411
NameBDBM50442411
Synonyms:CHEMBL2443073
TypeSmall organic molecule
Emp. Form.C21H20ClF3N2O3
Mol. Mass.440.843
SMILESOC1CC2(CCN(CC2)C(=O)Nc2ccc(cc2)C(F)(F)F)Oc2c(Cl)cccc12