Reaction Details
TargetTransient receptor potential cation channel subfamily V member 1
LigandBDBM50133817
Substrate/Competitorn/a
Meas. Tech.ChEMBL_989519 (CHEMBL2444306)
IC50 35±n/a nM
Citation Chaudhari, SSKadam, ABKhairatkar-Joshi, NMukhopadhyay, IKarnik, PVRaghuram, ARao, SSVaiyapuri, TSWale, DPBhosale, VMGudi, GSSangana, RRThomas, A Synthesis and pharmacological evaluation of novel N-aryl-3,4-dihydro-1'H-spiro[chromene-2,4'-piperidine]-1'-carboxamides as TRPM8 antagonists. Bioorg Med Chem21:6542-53 (2013) 
 
Transient receptor potential cation channel subfamily V member 1
Name:Transient receptor potential cation channel subfamily V member 1
Type:Protein
Mol. Mass.:94960.75
Organism:Homo sapiens (Human)
Description:Q8NER1
Residue:839
BDBM50133817
NameBDBM50133817
Synonyms:4-(3-Chloro-pyridin-2-yl)-piperazine-1-carboxylic acid (4-tert-butyl-phenyl)-amide CHEMBL441472 | N-(4-tert-butylphenyl)-4-(3-chloropyridin-2-yl)piperazine-1-carboxamide
TypeSmall organic molecule
Emp. Form.C20H25ClN4O
Mol. Mass.372.892
SMILESCC(C)(C)c1ccc(NC(=O)N2CCN(CC2)c2ncccc2Cl)cc1