Reaction Details
TargetAldo-keto reductase family 1 member B1
LigandBDBM50442496
Substrate/Competitorn/a
Meas. Tech.ChEMBL_990161 (CHEMBL2444356)
IC50 28±n/a nM
Citation Endo, SHu, DSuyama, MMatsunaga, TSugimoto, KMatsuya, YEl-Kabbani, OKuwata, KHara, AKitade, YToyooka, N Synthesis and structure-activity relationship of 2-phenyliminochromene derivatives as inhibitors for aldo-keto reductase (AKR) 1B10. Bioorg Med Chem21:6378-84 (2013) 
 
Aldo-keto reductase family 1 member B1
Name:Aldo-keto reductase family 1 member B1
Type:Protein
Mol. Mass.:35855.50
Organism:Homo sapiens (Human)
Description:P15121. 4LAU; 2IKI; 4LB4; 2FZD; 2FZ8; 1US0
Residue:316
BDBM50442496
NameBDBM50442496
Synonyms:CHEMBL2440413
TypeSmall organic molecule
Emp. Form.C21H22N2O4
Mol. Mass.366.4104
SMILESCOc1ccc(cc1)\N=c1/oc2cc(O)ccc2cc1C(=O)NCC(C)C