Reaction Details
TargetAldo-keto reductase family 1 member B10
LigandBDBM50442500
Substrate/Competitorn/a
Meas. Tech.ChEMBL_990162 (CHEMBL2444357)
IC50 14±n/a nM
Citation Endo, SHu, DSuyama, MMatsunaga, TSugimoto, KMatsuya, YEl-Kabbani, OKuwata, KHara, AKitade, YToyooka, N Synthesis and structure-activity relationship of 2-phenyliminochromene derivatives as inhibitors for aldo-keto reductase (AKR) 1B10. Bioorg Med Chem21:6378-84 (2013) 
 
Aldo-keto reductase family 1 member B10
Name:Aldo-keto reductase family 1 member B10
Type:Protein
Mol. Mass.:36024.67
Organism:Homo sapiens (Human)
Description:O60218. 1ZUA; 4JII; 4GQ0
Residue:316
BDBM50442500
NameBDBM50442500
Synonyms:CHEMBL2440425
TypeSmall organic molecule
Emp. Form.C21H14BrN3O3
Mol. Mass.436.258
SMILESOc1ccc2cc(C(=O)Nc3ccccn3)\c(=N\c3ccc(Br)cc3)oc2c1