Reaction Details
TargetMatrix metalloproteinase-14
LigandBDBM50442514
Substrate/Competitorn/a
Meas. Tech.ChEMBL_990167 (CHEMBL2444631)
IC50>100000±n/a nM
Citation Tauro, MLaghezza, ALoiodice, FAgamennone, MCampestre, CTortorella, P Arylamino methylene bisphosphonate derivatives as bone seeking matrix metalloproteinase inhibitors. Bioorg Med Chem21:6456-65 (2013) 
 
Matrix metalloproteinase-14
Name:Matrix metalloproteinase-14
Type:Protein
Mol. Mass.:65900.19
Organism:Homo sapiens (Human)
Description:P50281
Residue:582
BDBM50442514
NameBDBM50442514
Synonyms:CHEMBL2440435
TypeSmall organic molecule
Emp. Form.C8H10F3NO6P2
Mol. Mass.335.1108
SMILESOP(O)(=O)C(Nc1cccc(c1)C(F)(F)F)P(O)(O)=O