Reaction Details
TargetInward rectifier potassium channel 13
LigandBDBM50442600
Substrate/Competitorn/a
Meas. Tech.ChEMBL_990651 (CHEMBL2443473)
IC50>10000±n/a nM
Citation Tang, Hde Jesus, RKWalsh, SPZhu, YYan, YPriest, BTSwensen, AMAlonso-Galicia, MFelix, JPBrochu, RMBailey, TThomas-Fowlkes, BZhou, XPai, LYHampton, CHernandez, MOwens, KRoy, SKaczorowski, GJYang, LGarcia, MLPasternak, A Discovery of a novel sub-class of ROMK channel inhibitors typified by 5-(2-(4-(2-(4-(1H-Tetrazol-1-yl)phenyl)acetyl)piperazin-1-yl)ethyl)isobenzofuran-1(3H)-one. Bioorg Med Chem Lett23:5829-32 (2013) 
 
Inward rectifier potassium channel 13
Name:Inward rectifier potassium channel 13
Type:PROTEIN
Mol. Mass.:40527.12
Organism:Homo sapiens (Human)
Description:ChEMBL_105176
Residue:360
BDBM50442600
NameBDBM50442600
Synonyms:CHEMBL2441437 | US9056859, 1
TypeSmall organic molecule
Emp. Form.C23H24N6O3
Mol. Mass.432.4751
SMILESO=C(Cc1ccc(cc1)-n1cnnn1)N1CCN(CCc2ccc3C(=O)OCc3c2)CC1