Reaction Details
TargetATP-sensitive inward rectifier potassium channel 1
LigandBDBM50442621
Substrate/Competitorn/a
Meas. Tech.ChEMBL_990661 (CHEMBL2443483)
IC50 330±n/a nM
Citation Tang, Hde Jesus, RKWalsh, SPZhu, YYan, YPriest, BTSwensen, AMAlonso-Galicia, MFelix, JPBrochu, RMBailey, TThomas-Fowlkes, BZhou, XPai, LYHampton, CHernandez, MOwens, KRoy, SKaczorowski, GJYang, LGarcia, MLPasternak, A Discovery of a novel sub-class of ROMK channel inhibitors typified by 5-(2-(4-(2-(4-(1H-Tetrazol-1-yl)phenyl)acetyl)piperazin-1-yl)ethyl)isobenzofuran-1(3H)-one. Bioorg Med Chem Lett23:5829-32 (2013) 
 
ATP-sensitive inward rectifier potassium channel 1
Name:ATP-sensitive inward rectifier potassium channel 1
Type:Enzyme Catalytic Domain
Mol. Mass.:44809.08
Organism:Homo sapiens (Human)
Description:gi_223460826
Residue:391
BDBM50442621
NameBDBM50442621
Synonyms:CHEMBL2441415
TypeSmall organic molecule
Emp. Form.C26H28N6O3
Mol. Mass.472.5389
SMILESO=C(Cc1ccc(cc1C1CC1)-n1cnnn1)N1CCN(CCc2ccc3C(=O)OCc3c2)CC1