Reaction Details
TargetSerine/threonine-protein kinase pim-1
LigandBDBM50442677
Substrate/Competitorn/a
Meas. Tech.ChEMBL_989150 (CHEMBL2446213)
IC50 7.2±n/a nM
Citation Dwyer, MPKeertikar, KParuch, KAlvarez, CLabroli, MPoker, CFischmann, TOMayer-Ezell, RBond, RWang, YAzevedo, RGuzi, TJ Discovery of pyrazolo[1,5-a]pyrimidine-based Pim inhibitors: a template-based approach. Bioorg Med Chem Lett23:6178-82 (2013) 
 
Serine/threonine-protein kinase pim-1
Name:Serine/threonine-protein kinase pim-1
Type:Protein
Mol. Mass.:35681.82
Organism:Homo sapiens (Human)
Description:P11309
Residue:313
BDBM50442677
NameBDBM50442677
Synonyms:CHEMBL2442304
TypeSmall organic molecule
Emp. Form.C15H15N7O
Mol. Mass.309.3259
SMILESNCCNc1ccn2ncc(-c3ccc4[nH]c(=O)[nH]c4c3)c2n1