Reaction Details
TargetSerine/threonine-protein kinase pim-1
LigandBDBM50442691
Substrate/Competitorn/a
Meas. Tech.ChEMBL_989150 (CHEMBL2446213)
IC50 6.8±n/a nM
Citation Dwyer, MPKeertikar, KParuch, KAlvarez, CLabroli, MPoker, CFischmann, TOMayer-Ezell, RBond, RWang, YAzevedo, RGuzi, TJ Discovery of pyrazolo[1,5-a]pyrimidine-based Pim inhibitors: a template-based approach. Bioorg Med Chem Lett23:6178-82 (2013) 
 
Serine/threonine-protein kinase pim-1
Name:Serine/threonine-protein kinase pim-1
Type:Protein
Mol. Mass.:35681.82
Organism:Homo sapiens (Human)
Description:P11309
Residue:313
BDBM50442691
NameBDBM50442691
Synonyms:CHEMBL2442295
TypeSmall organic molecule
Emp. Form.C20H19N5
Mol. Mass.329.3984
SMILESC1CN(CCN1)c1ccn2ncc(-c3ccc4ccccc4c3)c2n1