Reaction Details
TargetSerine/threonine-protein kinase pim-1
LigandBDBM50442693
Substrate/Competitorn/a
Meas. Tech.ChEMBL_989150 (CHEMBL2446213)
IC50 3.1±n/a nM
Citation Dwyer, MPKeertikar, KParuch, KAlvarez, CLabroli, MPoker, CFischmann, TOMayer-Ezell, RBond, RWang, YAzevedo, RGuzi, TJ Discovery of pyrazolo[1,5-a]pyrimidine-based Pim inhibitors: a template-based approach. Bioorg Med Chem Lett23:6178-82 (2013) 
 
Serine/threonine-protein kinase pim-1
Name:Serine/threonine-protein kinase pim-1
Type:Protein
Mol. Mass.:35681.82
Organism:Homo sapiens (Human)
Description:P11309
Residue:313
BDBM50442693
NameBDBM50442693
Synonyms:CHEMBL2442316
TypeSmall organic molecule
Emp. Form.C22H23N5
Mol. Mass.357.4515
SMILESN[C@H]1CC[C@@H](CC1)Nc1ccn2ncc(-c3ccc4ccccc4c3)c2n1