Reaction Details
TargetSerine/threonine-protein kinase pim-2
LigandBDBM50442693
Substrate/Competitorn/a
Meas. Tech.ChEMBL_989149 (CHEMBL2446212)
IC50 190±n/a nM
Citation Dwyer, MPKeertikar, KParuch, KAlvarez, CLabroli, MPoker, CFischmann, TOMayer-Ezell, RBond, RWang, YAzevedo, RGuzi, TJ Discovery of pyrazolo[1,5-a]pyrimidine-based Pim inhibitors: a template-based approach. Bioorg Med Chem Lett23:6178-82 (2013) 
 
Serine/threonine-protein kinase pim-2
Name:Serine/threonine-protein kinase pim-2
Type:Serine/threonine-protein kinase
Mol. Mass.:34185.93
Organism:Homo sapiens (Human)
Description:Q9P1W9
Residue:311
BDBM50442693
NameBDBM50442693
Synonyms:CHEMBL2442316
TypeSmall organic molecule
Emp. Form.C22H23N5
Mol. Mass.357.4515
SMILESN[C@H]1CC[C@@H](CC1)Nc1ccn2ncc(-c3ccc4ccccc4c3)c2n1