Reaction Details
TargetFarnesyl pyrophosphate synthase
LigandBDBM50432306
Substrate/Competitorn/a
Meas. Tech.ChEMBL_1275828 (CHEMBL3091236)
IC50 22±n/a nM
Citation Leung, CYPark, JDe Schutter, JWSebag, MBerghuis, AMTsantrizos, YS Thienopyrimidine bisphosphonate (ThPBP) inhibitors of the human farnesyl pyrophosphate synthase: optimization and characterization of the mode of inhibition. J Med Chem56:7939-50 (2013) 
 
Farnesyl pyrophosphate synthase
Name:Farnesyl pyrophosphate synthase
Type:Enzyme
Mol. Mass.:48272.89
Organism:Homo sapiens (Human)
Description:P14324
Residue:419
BDBM50432306
NameBDBM50432306
Synonyms:CHEMBL2347862
TypeSmall organic molecule
Emp. Form.C14H15N3O6P2S
Mol. Mass.415.298
SMILESCc1ccc(cc1)-c1cc2c(NC(P(O)(O)=O)P(O)(O)=O)ncnc2s1