Reaction Details
TargetLysosomal Pro-X carboxypeptidase
LigandBDBM50443351
Substrate/Competitorn/a
Meas. Tech.ChEMBL_1275524 (CHEMBL3090539)
IC50 0.740000±n/a nM
Citation Debenham, JSGraham, THVerras, AZhang, YClements, MJKuethe, JTMadsen-Duggan, CLiu, WBhatt, URChen, DChen, QGarcia-Calvo, MGeissler, WMHe, HLi, XLisnock, JShen, ZTong, XTung, ECWiltsie, JXu, SHale, JJPinto, SShen, DM Discovery and optimization of orally active cyclohexane-based prolylcarboxypeptidase (PrCP) inhibitors. Bioorg Med Chem Lett23:6228-33 (2013) 
 
Lysosomal Pro-X carboxypeptidase
Name:Lysosomal Pro-X carboxypeptidase
Type:PROTEIN
Mol. Mass.:55028.96
Organism:Mus musculus
Description:ChEMBL_1335505
Residue:491
BDBM50443351
NameBDBM50443351
Synonyms:CHEMBL3086037 | US8669252, 15
TypeSmall organic molecule
Emp. Form.C29H31BrClN3O2
Mol. Mass.568.932
SMILESClc1ccc(cc1)C(NC(=O)[C@@H]1CC[C@H](C[C@H]1c1ccc(Br)cc1)N1CCOCC1)c1ccncc1