Reaction Details
TargetNeuropeptide S receptor
LigandBDBM50443390
Substrate/Competitorn/a
Meas. Tech.ChEMBL_1276607 (CHEMBL3088892)
IC50 45±n/a nM
Citation Patnaik, SMarugan, JJLiu, KZheng, WSouthall, NDehdashti, SJThorsell, AHeilig, MBell, LZook, MEskay, BBrimacombe, KRAustin, CP Structure-activity relationship of imidazopyridinium analogues as antagonists of neuropeptide s receptor. J Med Chem56:9045-56 (2013) 
 
Neuropeptide S receptor
Name:Neuropeptide S receptor
Type:PROTEIN
Mol. Mass.:42692.30
Organism:Homo sapiens (Human)
Description:ChEMBL_1276607
Residue:371
BDBM50443390
NameBDBM50443390
Synonyms:CHEMBL1474387
TypeSmall organic molecule
Emp. Form.C29H26N2PS
Mol. Mass.465.568
SMILESCc1c(n2ccccc2[n+]1C\C=C\c1ccccc1)P(=S)(c1ccccc1)c1ccccc1