Reaction Details
Target5'-nucleotidase
LigandBDBM50443528
Substrate/Competitorn/a
Meas. Tech.ChEMBL_1275399 (CHEMBL3090248)
IC50 44300±n/a nM
Citation Iqbal, JSaeed, ARaza, RMatin, AHameed, AFurtmann, NLecka, JSévigny, JBajorath, J Identification of sulfonic acids as efficient ecto-5'-nucleotidase inhibitors. Eur J Med Chem70:685-91 (2013) 
 
5'-nucleotidase
Name:5'-nucleotidase
Type:Enzyme
Mol. Mass.:63971.44
Organism:Rattus norvegicus (Rat)
Description:P21588
Residue:576
BDBM50443528
NameBDBM50443528
Synonyms:CHEMBL3088000
TypeSmall organic molecule
Emp. Form.C10H10N2O4S
Mol. Mass.254.262
SMILESCc1cc(=O)n([nH]1)-c1ccc(cc1)S(O)(=O)=O