Reaction Details
TargetHexokinase-4
LigandBDBM50444411
Substrate/Competitorn/a
Meas. Tech.ChEMBL_1279814 (CHEMBL3095515)
EC50>10000±n/a nM
Citation Stevens, BDLitchfield, JPfefferkorn, JAAtkinson, KPerreault, CAmor, PBahnck, KBerliner, MACalloway, JCarlo, ADerksen, DRFilipski, KJGumkowski, MJassal, CMacDougall, MMurphy, BNkansah, PPettersen, JRotter, CZhang, Y Discovery of an intravenous hepatoselective glucokinase activator for the treatment of inpatient hyperglycemia. Bioorg Med Chem Lett23:6588-92 (2013) 
 
Hexokinase-4
Name:Hexokinase-4
Type:Enzyme
Mol. Mass.:52175.81
Organism:Homo sapiens (Human)
Description:P35557
Residue:465
BDBM50444411
NameBDBM50444411
Synonyms:CHEMBL3091585
TypeSmall organic molecule
Emp. Form.C21H26N4O6S
Mol. Mass.462.519
SMILESOC(=O)c1ccc(NC(=O)[C@H](CC2CCOCC2)n2cnc(c2)S(=O)(=O)C2CCC2)nc1