Reaction Details
TargetHexokinase-4
LigandBDBM50444414
Substrate/Competitorn/a
Meas. Tech.ChEMBL_1279814 (CHEMBL3095515)
EC50 113±n/a nM
Citation Stevens, BDLitchfield, JPfefferkorn, JAAtkinson, KPerreault, CAmor, PBahnck, KBerliner, MACalloway, JCarlo, ADerksen, DRFilipski, KJGumkowski, MJassal, CMacDougall, MMurphy, BNkansah, PPettersen, JRotter, CZhang, Y Discovery of an intravenous hepatoselective glucokinase activator for the treatment of inpatient hyperglycemia. Bioorg Med Chem Lett23:6588-92 (2013) 
 
Hexokinase-4
Name:Hexokinase-4
Type:Enzyme
Mol. Mass.:52175.81
Organism:Homo sapiens (Human)
Description:P35557
Residue:465
BDBM50444414
NameBDBM50444414
Synonyms:CHEMBL3091582
TypeSmall organic molecule
Emp. Form.C21H26N4O5S
Mol. Mass.446.52
SMILESOC(=O)c1ccc(NC(=O)[C@H](CC2CCCCC2)n2cnc(c2)S(=O)(=O)C2CC2)nc1