Reaction Details
TargetP2Y purinoceptor 1
LigandBDBM50444483
Substrate/Competitorn/a
Meas. Tech.ChEMBL_1277497 (CHEMBL3096017)
Ki 60±n/a nM
Citation Ruel, RL'Heureux, AThibeault, CLapointe, PMartel, AQiao, JXHua, JPrice, LAWu, QChang, MZheng, JHuang, CSWexler, RRRehfuss, RLam, PY Potent P2Y1 urea antagonists bearing various cyclic amine scaffolds. Bioorg Med Chem Lett23:6825-8 (2013) 
 
P2Y purinoceptor 1
Name:P2Y purinoceptor 1
Type:Enzyme
Mol. Mass.:42090.25
Organism:Homo sapiens (Human)
Description:P47900
Residue:373
BDBM50444483
NameBDBM50444483
Synonyms:CHEMBL3092614
TypeSmall organic molecule
Emp. Form.C26H27F3N4O3
Mol. Mass.500.5128
SMILESCC(C)CN1CCc2c(C1)cccc2Oc1ncccc1NC(=O)Nc1ccc(OC(F)(F)F)cc1