Reaction Details
TargetHistamine H3 receptor
LigandBDBM50444490
Substrate/Competitorn/a
Meas. Tech.ChEMBL_1277742 (CHEMBL3097342)
Ki 2.5±n/a nM
Citation Wilson, DMApps, JBailey, NBamford, MJBeresford, IJBrackenborough, KBriggs, MABrough, SCalver, ARCrook, BDavis, RKDavis, RPDavis, SDean, DKHarris, LHeslop, THolland, VJeffrey, PPanchal, TAParr, CAQuashie, NSchogger, JSehmi, SSStean, TOSteadman, JGTrail, BWald, JWorby, ATakle, AKWitherington, JMedhurst, AD Identification of clinical candidates from the benzazepine class of histamine H3 receptor antagonists. Bioorg Med Chem Lett23:6890-6 (2013) 
 
Histamine H3 receptor
Name:Histamine H3 receptor
Type:G Protein-Coupled Receptor (GPCR)
Mol. Mass.:48607.98
Organism:Rattus norvegicus (rat)
Description:n/a
Residue:445
BDBM50444490
NameBDBM50444490
Synonyms:CHEMBL3092824
TypeSmall organic molecule
Emp. Form.C24H29N3O2
Mol. Mass.391.506
SMILESO=C1CCCCN1c1ccc(Oc2ccc3CCN(CCc3c2)C2CCC2)nc1