Reaction Details
TargetPerforin-1
LigandBDBM50445267
Substrate/Competitorn/a
Meas. Tech.ChEMBL_1285138 (CHEMBL3106784)
IC50 640±n/a nM
Citation Spicer, JALena, GLyons, DMHuttunen, KMMiller, CKO'Connor, PDBull, MHelsby, NJamieson, SMDenny, WACiccone, ABrowne, KALopez, JARudd-Schmidt, JVoskoboinik, ITrapani, JA Exploration of a series of 5-arylidene-2-thioxoimidazolidin-4-ones as inhibitors of the cytolytic protein perforin. J Med Chem56:9542-55 (2014) 
 
Perforin-1
Name:Perforin-1
Type:PROTEIN
Mol. Mass.:61392.32
Organism:Homo sapiens (Human)
Description:ChEMBL_1285138
Residue:555
BDBM50445267
NameBDBM50445267
Synonyms:CHEMBL3103647
TypeSmall organic molecule
Emp. Form.C17H13N3O2S2
Mol. Mass.355.434
SMILESO=C1NC(=S)N\C1=C\c1ccc(s1)-c1ccc2CCNC(=O)c2c1