Reaction Details
TargetPerforin-1
LigandBDBM50445279
Substrate/Competitorn/a
Meas. Tech.ChEMBL_1285138 (CHEMBL3106784)
IC50 530±n/a nM
Citation Spicer, JALena, GLyons, DMHuttunen, KMMiller, CKO'Connor, PDBull, MHelsby, NJamieson, SMDenny, WACiccone, ABrowne, KALopez, JARudd-Schmidt, JVoskoboinik, ITrapani, JA Exploration of a series of 5-arylidene-2-thioxoimidazolidin-4-ones as inhibitors of the cytolytic protein perforin. J Med Chem56:9542-55 (2014) 
 
Perforin-1
Name:Perforin-1
Type:PROTEIN
Mol. Mass.:61392.32
Organism:Homo sapiens (Human)
Description:ChEMBL_1285138
Residue:555
BDBM50445279
NameBDBM50445279
Synonyms:CHEMBL3103914
TypeSmall organic molecule
Emp. Form.C19H17N3O3S2
Mol. Mass.399.487
SMILESOCCCN1Cc2cc(ccc2C1=O)-c1ccc(\C=C2\NC(=S)NC2=O)s1