Reaction Details
TargetNeuronal acetylcholine receptor; alpha9/alpha10
LigandBDBM50445328
Substrate/Competitorn/a
Meas. Tech.ChEMBL_1285298 (CHEMBL3107449)
IC50 5.2±n/a nM
Citation Luo, SZhangsun, DZhu, XWu, YHu, YChristensen, SHarvey, PJAkcan, MCraik, DJMcIntosh, JM Characterization of a novela-conotoxin TxID from Conus textile that potently blocks rata3ß4 nicotinic acetylcholine receptors. J Med Chem56:9655-63 (2014) 
 
Neuronal acetylcholine receptor; alpha9/alpha10
Name:Neuronal acetylcholine receptor; alpha9/alpha10
Type:n/a
Mol. Mass.:n/a
Description:ASSAY_ID of ChEMBL is 2150170
Components:This complex has 2 components.
Component 1
Name:Neuronal acetylcholine receptor subunit alpha-9
Synonyms:ACHA9_HUMAN NACHR alpha-9 Neuronal acetylcholine receptor protein alpha-9 subunit Nicotinic acetylcholine receptor subunit alpha-9
Type:PROTEIN
Mol. Mass.:54806.10
Organism:Homo sapiens (Human)
Description:ChEMBL_306102
Residue:479
Component 2
Name:Neuronal acetylcholine receptor subunit alpha-10
Synonyms:ACH10_HUMAN NACHRA10 | Neuronal acetylcholine receptor protein alpha-10 subunit
Type:PROTEIN
Mol. Mass.:49714.45
Organism:Homo sapiens (Human)
Description:EBI_12740
Residue:450
BDBM50445328
NameBDBM50445328
Synonyms:CHEMBL3104241
TypeSmall organic molecule
Emp. Form.C59H96N26O17S4
Mol. Mass.1569.818
SMILES[#7]-[#6]-[#6](=O)-[#7]-[#6@H]-1-[#6]-[#16]-[#16]-[#6]-[#6@@H]-2-[#7]-[#6](=O)-[#6@H](-[#6]-[#6]-[#6]\[#7]=[#6](/[#7])-[#7])-[#7]-[#6](=O)-[#6@@H]-3-[#6]-[#6]-[#6]-[#7]-3-[#6](=O)-[#6@H](-[#6]-[#6](-[#8])=O)-[#7]-[#6](=O)-[#6@H](-[#6]-[#8])-[#7]-[#6](=O)-[#6@H](-[#6]-[#16]-[#16]-[#6]-[#6@H](-[#7]-[#6](=O)-[#6@H](-[#6]-[#6]-[#6]\[#7]=[#6](/[#7])-[#7])-[#7]-[#6](=O)-[#6@H](-[#6]-c3ccc(-[#8])cc3)-[#7]-[#6](=O)-[#6@H](-[#6]-[#6]-[#6]\[#7]=[#6](/[#7])-[#7])-[#7]-[#6]-2=O)-[#6](=O)-[#7]-[#6@@H](-[#6]-[#6]-[#6]\[#7]=[#6](/[#7])-[#7])-[#6](-[#7])=O)-[#7]-[#6]-1=O