Reaction Details
TargetBotulinum neurotoxin type A
LigandBDBM50445590
Substrate/Competitorn/a
Meas. Tech.ChEMBL_1285734 (CHEMBL3107723)
EC50>1000000±n/a nM
Citation Seki, HPellett, SSilhár, PStowe, GNBlanco, BLardy, MAJohnson, EAJanda, KD Synthesis/biological evaluation of hydroxamic acids and their prodrugs as inhibitors for Botulinum neurotoxin A light chain. Bioorg Med Chem22:1208-17 (2014) 
 
Botulinum neurotoxin type A
Name:Botulinum neurotoxin type A
Type:PROTEIN
Mol. Mass.:149450.01
Organism:Clostridium botulinum
Description:ChEMBL_1510137
Residue:1296
BDBM50445590
NameBDBM50445590
Synonyms:CHEMBL3103445
TypeSmall organic molecule
Emp. Form.C30H35BrCl2N2O4
Mol. Mass.638.42
SMILESClc1ccc(C(CCOCC23CC4CC(CC(Br)(C4)C2)C3)CC(=O)NOC(=O)NCc2ccccc2)c(Cl)c1