Reaction Details
TargetBotulinum neurotoxin type A
LigandBDBM50445594
Substrate/Competitorn/a
Meas. Tech.ChEMBL_1285734 (CHEMBL3107723)
EC50>300000±n/a nM
Citation Seki, HPellett, SSilhár, PStowe, GNBlanco, BLardy, MAJohnson, EAJanda, KD Synthesis/biological evaluation of hydroxamic acids and their prodrugs as inhibitors for Botulinum neurotoxin A light chain. Bioorg Med Chem22:1208-17 (2014) 
 
Botulinum neurotoxin type A
Name:Botulinum neurotoxin type A
Type:PROTEIN
Mol. Mass.:149450.01
Organism:Clostridium botulinum
Description:ChEMBL_1510137
Residue:1296
BDBM50445594
NameBDBM50445594
Synonyms:CHEMBL3103459
TypeSmall organic molecule
Emp. Form.C26H24Cl2FN3O5
Mol. Mass.548.39
SMILESCOc1cc(F)ccc1NC(=O)CC(CC(=O)NOC(=O)NCc1ccccc1)c1ccc(Cl)cc1Cl