Reaction Details
TargetNuclear receptor ROR-gamma
LigandBDBM50445878
Substrate/Competitorn/a
Meas. Tech.ChEMBL_1285940 (CHEMBL3106083)
Ki 398±n/a nM
Citation Wang, YCai, WZhang, GYang, TLiu, QCheng, YZhou, LMa, YCheng, ZLu, SZhao, YGZhang, WXiang, ZWang, SYang, LWu, QOrband-Miller, LAXu, YZhang, JGao, RHuxdorf, MXiang, JNZhong, ZElliott, JDLeung, SLin, X Discovery of novel N-(5-(arylcarbonyl)thiazol-2-yl)amides and N-(5-(arylcarbonyl)thiophen-2-yl)amides as potent ROR¿t inhibitors. Bioorg Med Chem22:692-702 (2014) 
 
Nuclear receptor ROR-gamma
Name:Nuclear receptor ROR-gamma
Type:Enzyme Catalytic Domain
Mol. Mass.:58218.40
Organism:Homo sapiens (Human)
Description:P51449
Residue:518
BDBM50445878
NameBDBM50445878
Synonyms:CHEMBL3105815
TypeSmall organic molecule
Emp. Form.C19H16Cl2N2O3S2
Mol. Mass.455.378
SMILESCCS(=O)(=O)c1ccc(CC(=O)Nc2nc(cs2)-c2cc(Cl)ccc2Cl)cc1