Reaction Details
TargetNuclear receptor ROR-gamma
LigandBDBM50445875
Substrate/Competitorn/a
Meas. Tech.ChEMBL_1285942 (CHEMBL3106085)
IC50 16±n/a nM
Citation Wang, YCai, WZhang, GYang, TLiu, QCheng, YZhou, LMa, YCheng, ZLu, SZhao, YGZhang, WXiang, ZWang, SYang, LWu, QOrband-Miller, LAXu, YZhang, JGao, RHuxdorf, MXiang, JNZhong, ZElliott, JDLeung, SLin, X Discovery of novel N-(5-(arylcarbonyl)thiazol-2-yl)amides and N-(5-(arylcarbonyl)thiophen-2-yl)amides as potent ROR¿t inhibitors. Bioorg Med Chem22:692-702 (2014) 
 
Nuclear receptor ROR-gamma
Name:Nuclear receptor ROR-gamma
Type:PROTEIN
Mol. Mass.:58133.31
Organism:Mus musculus
Description:ChEMBL_103664
Residue:516
BDBM50445875
NameBDBM50445875
Synonyms:CHEMBL3105671
TypeSmall organic molecule
Emp. Form.C27H21ClFNO4S2
Mol. Mass.542.041
SMILESCCS(=O)(=O)c1ccc(CC(=O)Nc2cc(c(s2)C(=O)c2cccc(F)c2)-c2cccc(Cl)c2)cc1