Reaction Details
TargetAurora kinase A
LigandBDBM50420401
Substrate/Competitorn/a
Meas. Tech.ChEMBL_1287772 (CHEMBL3111604)
IC50>100000±n/a nM
Citation Naud, SWestwood, IMFaisal, ASheldrake, PBavetsias, VAtrash, BCheung, KMLiu, MHayes, ASchmitt, JWood, AChoi, VBoxall, KMak, GGurden, MValenti, Mde Haven Brandon, AHenley, ABaker, RMcAndrew, CMatijssen, BBurke, RHoelder, SEccles, SARaynaud, FILinardopoulos, Svan Montfort, RLBlagg, J Structure-based design of orally bioavailable 1H-pyrrolo[3,2-c]pyridine inhibitors of mitotic kinase monopolar spindle 1 (MPS1). J Med Chem56:10045-65 (2013) 
 
Aurora kinase A
Name:Aurora kinase A
Type:Serine/threonine-protein kinase
Mol. Mass.:45830.98
Organism:Homo sapiens (Human)
Description:O14965
Residue:403
BDBM50420401
NameBDBM50420401
Synonyms:CHEMBL2089255 | US11208696, Example 31
TypeSmall organic molecule
Emp. Form.C17H20N6O
Mol. Mass.324.3803
SMILESCC(C)(C)Nc1nc(Nc2ccc(cc2)C(N)=O)cc(N)c1C#N