Reaction Details
TargetAurora kinase A
LigandBDBM50446453
Substrate/Competitorn/a
Meas. Tech.ChEMBL_1287772 (CHEMBL3111604)
IC50>100000±n/a nM
Citation Naud, SWestwood, IMFaisal, ASheldrake, PBavetsias, VAtrash, BCheung, KMLiu, MHayes, ASchmitt, JWood, AChoi, VBoxall, KMak, GGurden, MValenti, Mde Haven Brandon, AHenley, ABaker, RMcAndrew, CMatijssen, BBurke, RHoelder, SEccles, SARaynaud, FILinardopoulos, Svan Montfort, RLBlagg, J Structure-based design of orally bioavailable 1H-pyrrolo[3,2-c]pyridine inhibitors of mitotic kinase monopolar spindle 1 (MPS1). J Med Chem56:10045-65 (2013) 
 
Aurora kinase A
Name:Aurora kinase A
Type:Serine/threonine-protein kinase
Mol. Mass.:45830.98
Organism:Homo sapiens (Human)
Description:O14965
Residue:403
BDBM50446453
NameBDBM50446453
Synonyms:CHEMBL3109935
TypeSmall organic molecule
Emp. Form.C24H27ClN6O4S
Mol. Mass.531.027
SMILESCN(C)S(=O)(=O)c1ccc(Nc2cc3n(C(=O)OC(C)(C)C)c(cc3cn2)-c2cnn(C)c2)c(Cl)c1