Reaction Details
TargetDual specificity protein kinase TTK
LigandBDBM50446435
Substrate/Competitorn/a
Meas. Tech.ChEMBL_1287775 (CHEMBL3111607)
IC50 22±n/a nM
Citation Naud, SWestwood, IMFaisal, ASheldrake, PBavetsias, VAtrash, BCheung, KMLiu, MHayes, ASchmitt, JWood, AChoi, VBoxall, KMak, GGurden, MValenti, Mde Haven Brandon, AHenley, ABaker, RMcAndrew, CMatijssen, BBurke, RHoelder, SEccles, SARaynaud, FILinardopoulos, Svan Montfort, RLBlagg, J Structure-based design of orally bioavailable 1H-pyrrolo[3,2-c]pyridine inhibitors of mitotic kinase monopolar spindle 1 (MPS1). J Med Chem56:10045-65 (2013) 
 
Dual specificity protein kinase TTK
Name:Dual specificity protein kinase TTK
Type:Protein
Mol. Mass.:97086.79
Organism:Homo sapiens (Human)
Description:P33981
Residue:857
BDBM50446435
NameBDBM50446435
Synonyms:CHEMBL3109940
TypeSmall organic molecule
Emp. Form.C24H24ClN5O4
Mol. Mass.481.931
SMILESCN(C)C(=O)c1ccc(Nc2cc3n(C(=O)OC(C)(C)C)c(cc3cn2)-c2cnco2)c(Cl)c1