Reaction Details
TargetDual specificity protein kinase TTK
LigandBDBM50446443
Substrate/Competitorn/a
Meas. Tech.ChEMBL_1287775 (CHEMBL3111607)
IC50 7.0±n/a nM
Citation Naud, SWestwood, IMFaisal, ASheldrake, PBavetsias, VAtrash, BCheung, KMLiu, MHayes, ASchmitt, JWood, AChoi, VBoxall, KMak, GGurden, MValenti, Mde Haven Brandon, AHenley, ABaker, RMcAndrew, CMatijssen, BBurke, RHoelder, SEccles, SARaynaud, FILinardopoulos, Svan Montfort, RLBlagg, J Structure-based design of orally bioavailable 1H-pyrrolo[3,2-c]pyridine inhibitors of mitotic kinase monopolar spindle 1 (MPS1). J Med Chem56:10045-65 (2013) 
 
Dual specificity protein kinase TTK
Name:Dual specificity protein kinase TTK
Type:Protein
Mol. Mass.:97086.79
Organism:Homo sapiens (Human)
Description:P33981
Residue:857
BDBM50446443
NameBDBM50446443
Synonyms:CHEMBL3109936
TypeSmall organic molecule
Emp. Form.C26H27ClN6O3
Mol. Mass.506.984
SMILESCn1cc(cn1)-c1cc2cnc(Nc3ccc(cc3Cl)C(=O)N3CCC3)cc2n1C(=O)OC(C)(C)C