Reaction Details
TargetDual specificity protein kinase TTK
LigandBDBM50446451
Substrate/Competitorn/a
Meas. Tech.ChEMBL_1287775 (CHEMBL3111607)
IC50 3.0±n/a nM
Citation Naud, SWestwood, IMFaisal, ASheldrake, PBavetsias, VAtrash, BCheung, KMLiu, MHayes, ASchmitt, JWood, AChoi, VBoxall, KMak, GGurden, MValenti, Mde Haven Brandon, AHenley, ABaker, RMcAndrew, CMatijssen, BBurke, RHoelder, SEccles, SARaynaud, FILinardopoulos, Svan Montfort, RLBlagg, J Structure-based design of orally bioavailable 1H-pyrrolo[3,2-c]pyridine inhibitors of mitotic kinase monopolar spindle 1 (MPS1). J Med Chem56:10045-65 (2013) 
 
Dual specificity protein kinase TTK
Name:Dual specificity protein kinase TTK
Type:Protein
Mol. Mass.:97086.79
Organism:Homo sapiens (Human)
Description:P33981
Residue:857
BDBM50446451
NameBDBM50446451
Synonyms:CHEMBL3109945
TypeSmall organic molecule
Emp. Form.C26H26ClN7O2
Mol. Mass.503.983
SMILESCn1cc(cn1)-c1cc2cnc(Nc3ccc(cc3Cl)-c3cncn3C)cc2n1C(=O)OC(C)(C)C