Reaction Details
TargetAurora kinase B
LigandBDBM50446464
Substrate/Competitorn/a
Meas. Tech.ChEMBL_1287773 (CHEMBL3111605)
IC50>100000±n/a nM
Citation Naud, SWestwood, IMFaisal, ASheldrake, PBavetsias, VAtrash, BCheung, KMLiu, MHayes, ASchmitt, JWood, AChoi, VBoxall, KMak, GGurden, MValenti, Mde Haven Brandon, AHenley, ABaker, RMcAndrew, CMatijssen, BBurke, RHoelder, SEccles, SARaynaud, FILinardopoulos, Svan Montfort, RLBlagg, J Structure-based design of orally bioavailable 1H-pyrrolo[3,2-c]pyridine inhibitors of mitotic kinase monopolar spindle 1 (MPS1). J Med Chem56:10045-65 (2013) 
 
Aurora kinase B
Name:Aurora kinase B
Type:Protein
Mol. Mass.:39327.72
Organism:Homo sapiens (Human)
Description:Q96GD4
Residue:344
BDBM50446464
NameBDBM50446464
Synonyms:CHEMBL3109972
TypeSmall organic molecule
Emp. Form.C22H21ClN6O3S
Mol. Mass.484.959
SMILESCn1cc(cn1)-c1cc2cnc(Nc3ccc(cc3Cl)C(=O)N3CCS(=O)(=O)CC3)cc2[nH]1