Reaction Details
TargetPoly [ADP-ribose] polymerase 2
LigandBDBM50446537
Substrate/Competitorn/a
Meas. Tech.ChEMBL_1286324 (CHEMBL3111451)
IC50 1760±n/a nM
Citation Hua, ZBregman, HBuchanan, JLChakka, NGuzman-Perez, AGunaydin, HHuang, XGu, YBerry, VLiu, JTeffera, YHuang, LEgge, BEmkey, RMullady, ELSchneider, SAndrews, PSAcquaviva, LDovey, JMishra, ANewcomb, JSaffran, DSerafino, RStrathdee, CATurci, SMStanton, MWilson, CDimauro, EF Development of novel dual binders as potent, selective, and orally bioavailable tankyrase inhibitors. J Med Chem56:10003-15 (2013) 
 
Poly [ADP-ribose] polymerase 2
Name:Poly [ADP-ribose] polymerase 2
Type:Enzyme
Mol. Mass.:66225.70
Organism:Homo sapiens (Human)
Description:Q9UGN5
Residue:583
BDBM50446537
NameBDBM50446537
Synonyms:CHEMBL3110100 | US9505749, 106
TypeSmall organic molecule
Emp. Form.C24H24N4O3S
Mol. Mass.448.537
SMILESO=C(CCSc1nc2ccccc2c(=O)[nH]1)N[C@H]1CC[C@@H](CC1)Oc1ccc(cc1)C#N