Reaction Details
TargetCholinesterase
LigandBDBM50447020
Substrate/Competitorn/a
Meas. Tech.ChEMBL_1289180 (CHEMBL3119242)
IC50 2070±n/a nM
Citation González-Naranjo, PPérez-Macias, NCampillo, NEPérez, CArán, VJGirón, RSánchez-Robles, EMartín, MIGómez-Cañas, MGarcía-Arencibia, MFernández-Ruiz, JPáez, JA Cannabinoid agonists showing BuChE inhibition as potential therapeutic agents for Alzheimer's disease. Eur J Med Chem73:56-72 (2014) 
 
Cholinesterase
Name:Cholinesterase
Type:Enzyme
Mol. Mass.:65643.35
Organism:Equus caballus (Horse)
Description:P81908
Residue:574
BDBM50447020
NameBDBM50447020
Synonyms:CHEMBL3116294
TypeSmall organic molecule
Emp. Form.C25H26N4O3
Mol. Mass.430.4989
SMILES[O-][N+](=O)c1ccc2n(CCN3CCCCC3)nc(OCc3ccc4ccccc4c3)c2c1