Reaction Details
TargetCoagulation factor XI
LigandBDBM29388
Substrate/Competitorn/a
Meas. Tech.ChEMBL_1289209 (CHEMBL3119476)
IC50 20000±n/a nM
Citation Bach, PKnerr, LFjellström, OHansson, KMattsson, CGustafsson, D Design, synthesis, and SAR of a series of activated protein C (APC) inhibitors with selectivity against thrombin for the treatment of haemophilia. Bioorg Med Chem Lett24:821-7 (2014) 
 
Coagulation factor XI
Name:Coagulation factor XI
Type:Enzyme
Mol. Mass.:70130.58
Organism:Homo sapiens (Human)
Description:P03951
Residue:625
BDBM29388
NameBDBM29388
Synonyms:Exanta US11584714, Compound 999
TypeSmall organic molecule
Emp. Form.C22H31N5O4
Mol. Mass.429.5126
SMILESNC(=N)c1ccc(CNC(=O)[C@@H]2CCN2C(=O)[C@H](NCC(O)=O)C2CCCCC2)cc1