Reaction Details
TargetCoagulation factor X
LigandBDBM50447515
Substrate/Competitorn/a
Meas. Tech.ChEMBL_1289210 (CHEMBL3119477)
IC50>44000±n/a nM
Citation Bach, PKnerr, LFjellström, OHansson, KMattsson, CGustafsson, D Design, synthesis, and SAR of a series of activated protein C (APC) inhibitors with selectivity against thrombin for the treatment of haemophilia. Bioorg Med Chem Lett24:821-7 (2014) 
 
Coagulation factor X
Name:Coagulation factor X
Type:Enzyme
Mol. Mass.:54726.60
Organism:Homo sapiens (Human)
Description:n/a
Residue:488
BDBM50447515
NameBDBM50447515
Synonyms:CHEMBL3115901
TypeSmall organic molecule
Emp. Form.C28H38N6O4
Mol. Mass.522.6391
SMILESNC(=N)c1ccc(CNC(=O)[C@H](Cc2ccc(N)cc2)NC(=O)[C@@H](CC2CCCCC2)NCC(O)=O)cc1