Reaction Details
TargetVitamin K-dependent protein C
LigandBDBM50447527
Substrate/Competitorn/a
Meas. Tech.ChEMBL_1289202 (CHEMBL3119469)
Ki 500±n/a nM
Citation Bach, PKnerr, LFjellström, OHansson, KMattsson, CGustafsson, D Design, synthesis, and SAR of a series of activated protein C (APC) inhibitors with selectivity against thrombin for the treatment of haemophilia. Bioorg Med Chem Lett24:821-7 (2014) 
 
Vitamin K-dependent protein C
Name:Vitamin K-dependent protein C
Type:Enzyme
Mol. Mass.:52067.73
Organism:Homo sapiens (Human)
Description:n/a
Residue:461
BDBM50447527
NameBDBM50447527
Synonyms:CHEMBL3115905
TypeSmall organic molecule
Emp. Form.C22H36N8O2
Mol. Mass.444.5736
SMILES[#7]-[#6@H](-[#6]-1-[#6]-[#6]-[#6]-[#6]-[#6]-1)-[#6](=O)-[#7]-[#6@@H](-[#6]-[#6]-[#6]\[#7]=[#6](\[#7])-[#7])-[#6](=O)-[#7]-[#6]-c1ccc(cc1)-[#6](-[#7])=[#7]