Reaction Details
TargetCoagulation factor XI
LigandBDBM50447515
Substrate/Competitorn/a
Meas. Tech.ChEMBL_1289199 (CHEMBL3119261)
Ki 300±n/a nM
Citation Bach, PKnerr, LFjellström, OHansson, KMattsson, CGustafsson, D Design, synthesis, and SAR of a series of activated protein C (APC) inhibitors with selectivity against thrombin for the treatment of haemophilia. Bioorg Med Chem Lett24:821-7 (2014) 
 
Coagulation factor XI
Name:Coagulation factor XI
Type:Enzyme
Mol. Mass.:70130.58
Organism:Homo sapiens (Human)
Description:P03951
Residue:625
BDBM50447515
NameBDBM50447515
Synonyms:CHEMBL3115901
TypeSmall organic molecule
Emp. Form.C28H38N6O4
Mol. Mass.522.6391
SMILESNC(=N)c1ccc(CNC(=O)[C@H](Cc2ccc(N)cc2)NC(=O)[C@@H](CC2CCCCC2)NCC(O)=O)cc1