Reaction Details
TargetCoagulation factor XI
LigandBDBM50447518
Substrate/Competitorn/a
Meas. Tech.ChEMBL_1289199 (CHEMBL3119261)
Ki>19000±n/a nM
Citation Bach, PKnerr, LFjellström, OHansson, KMattsson, CGustafsson, D Design, synthesis, and SAR of a series of activated protein C (APC) inhibitors with selectivity against thrombin for the treatment of haemophilia. Bioorg Med Chem Lett24:821-7 (2014) 
 
Coagulation factor XI
Name:Coagulation factor XI
Type:Enzyme
Mol. Mass.:70130.58
Organism:Homo sapiens (Human)
Description:P03951
Residue:625
BDBM50447518
NameBDBM50447518
Synonyms:CHEMBL3115892
TypeSmall organic molecule
Emp. Form.C26H40N6O4
Mol. Mass.500.6336
SMILESNC(=N)c1ccc(CNC(=O)[C@@H](NC(=O)[C@@H](CC2CCCCC2)NCC(O)=O)C2CCNCC2)cc1