Reaction Details
TargetCoagulation factor XI
LigandBDBM50193243
Substrate/Competitorn/a
Meas. Tech.ChEMBL_1289199 (CHEMBL3119261)
Ki>19000±n/a nM
Citation Bach, PKnerr, LFjellström, OHansson, KMattsson, CGustafsson, D Design, synthesis, and SAR of a series of activated protein C (APC) inhibitors with selectivity against thrombin for the treatment of haemophilia. Bioorg Med Chem Lett24:821-7 (2014) 
 
Coagulation factor XI
Name:Coagulation factor XI
Type:Enzyme
Mol. Mass.:70130.58
Organism:Homo sapiens (Human)
Description:P03951
Residue:625
BDBM50193243
NameBDBM50193243
Synonyms:({(R)-[2-(4-carbamimidoyl-benzylcarbamoyl)-indan-2-ylcarbamoyl]-cyclohexyl-methyl}-amino)-acetic acid | CHEMBL215295
TypeSmall organic molecule
Emp. Form.C28H35N5O4
Mol. Mass.505.6086
SMILESNC(=N)c1ccc(CNC(=O)C2(Cc3ccccc3C2)NC(=O)[C@H](NCC(O)=O)C2CCCCC2)cc1