Reaction Details
TargetVitamin K-dependent protein C
LigandBDBM50447514
Substrate/Competitorn/a
Meas. Tech.ChEMBL_1289213 (CHEMBL3119480)
IC50 1100±n/a nM
Citation Bach, PKnerr, LFjellström, OHansson, KMattsson, CGustafsson, D Design, synthesis, and SAR of a series of activated protein C (APC) inhibitors with selectivity against thrombin for the treatment of haemophilia. Bioorg Med Chem Lett24:821-7 (2014) 
 
Vitamin K-dependent protein C
Name:Vitamin K-dependent protein C
Type:Enzyme
Mol. Mass.:52067.73
Organism:Homo sapiens (Human)
Description:n/a
Residue:461
BDBM50447514
NameBDBM50447514
Synonyms:CHEMBL3115903
TypeSmall organic molecule
Emp. Form.C29H40N6O4
Mol. Mass.536.6657
SMILESNCc1ccc(CC(NC(=O)[C@@H](CC2CCCCC2)NCC(O)=O)C(=O)NCc2ccc(cc2)C(N)=N)cc1