Reaction Details
TargetAlpha-ketoglutarate-dependent dioxygenase alkB homolog 3
LigandBDBM50447919
Substrate/Competitorn/a
Meas. Tech.ChEMBL_1288598 (CHEMBL3119218)
IC50>10000±n/a nM
Citation Nakao, SMabuchi, MShimizu, TItoh, YTakeuchi, YUeda, MMizuno, HShigi, NOhshio, IJinguji, KUeda, YYamamoto, MFurukawa, TAoki, STsujikawa, KTanaka, A Design and synthesis of prostate cancer antigen-1 (PCA-1/ALKBH3) inhibitors as anti-prostate cancer drugs. Bioorg Med Chem Lett24:1071-4 (2014) 
 
Alpha-ketoglutarate-dependent dioxygenase alkB homolog 3
Name:Alpha-ketoglutarate-dependent dioxygenase alkB homolog 3
Type:PROTEIN
Mol. Mass.:33382.86
Organism:Homo sapiens (Human)
Description:ChEMBL_108024
Residue:286
BDBM50447919
NameBDBM50447919
Synonyms:CHEMBL3114978
TypeSmall organic molecule
Emp. Form.C9H10N4O
Mol. Mass.190.2019
SMILESCc1[nH]n(-c2ncccn2)c(=O)c1C