Reaction Details
TargetLeucine-rich repeat serine/threonine-protein kinase 2
LigandBDBM50448111
Substrate/Competitorn/a
Meas. Tech.ChEMBL_1291901 (CHEMBL3124215)
IC50 14±n/a nM
Citation Estrada, AAChan, BKBaker-Glenn, CBeresford, ABurdick, DJChambers, MChen, HDominguez, SLDotson, JDrummond, JFlagella, MFuji, RGill, AHalladay, JHarris, SFHeffron, TPKleinheinz, TLee, DWLe Pichon, CELiu, XLyssikatos, JPMedhurst, ADMoffat, JGNash, KScearce-Levie, KSheng, ZShore, DGWong, SZhang, SZhang, XZhu, HSweeney, ZK Discovery of highly potent, selective, and brain-penetrant aminopyrazole leucine-rich repeat kinase 2 (LRRK2) small molecule inhibitors. J Med Chem57:921-36 (2014) 
 
Leucine-rich repeat serine/threonine-protein kinase 2
Name:Leucine-rich repeat serine/threonine-protein kinase 2
Type:Protein
Mol. Mass.:286113.20
Organism:Homo sapiens (Human)
Description:Q5S007
Residue:2527
BDBM50448111
NameBDBM50448111
Synonyms:CHEMBL3122116
TypeSmall organic molecule
Emp. Form.C18H23F4N7O
Mol. Mass.429.4151
SMILESCNc1nc(Nc2cn(nc2C)[C@H]2CCN(C[C@H]2F)C2COC2)ncc1C(F)(F)F