Reaction Details
TargetLeucine-rich repeat serine/threonine-protein kinase 2
LigandBDBM50448120
Substrate/Competitorn/a
Meas. Tech.ChEMBL_1291901 (CHEMBL3124215)
IC50 140±n/a nM
Citation Estrada, AAChan, BKBaker-Glenn, CBeresford, ABurdick, DJChambers, MChen, HDominguez, SLDotson, JDrummond, JFlagella, MFuji, RGill, AHalladay, JHarris, SFHeffron, TPKleinheinz, TLee, DWLe Pichon, CELiu, XLyssikatos, JPMedhurst, ADMoffat, JGNash, KScearce-Levie, KSheng, ZShore, DGWong, SZhang, SZhang, XZhu, HSweeney, ZK Discovery of highly potent, selective, and brain-penetrant aminopyrazole leucine-rich repeat kinase 2 (LRRK2) small molecule inhibitors. J Med Chem57:921-36 (2014) 
 
Leucine-rich repeat serine/threonine-protein kinase 2
Name:Leucine-rich repeat serine/threonine-protein kinase 2
Type:Protein
Mol. Mass.:286113.20
Organism:Homo sapiens (Human)
Description:Q5S007
Residue:2527
BDBM50448120
NameBDBM50448120
Synonyms:CHEMBL3122111
TypeSmall organic molecule
Emp. Form.C17H24F3N7O
Mol. Mass.399.414
SMILESCNc1nc(Nc2cn(nc2C)C(C)(C)C(=O)NC(C)C)ncc1C(F)(F)F